BDBM104707 US8569311, 1-34
SMILES C[C@@H]1CC[C@@H](COc2ccc(F)cn2)CN1C(=O)c1c(F)cccc1-c1ncccn1
InChI Key InChIKey=OYFDBWSFFPTFSO-HZPDHXFCSA-N
Data  2 KI
  Tab Delimited (TSV)   2D SDfile   Computed 3D by Vconf -m prep SDfile
Find this compound or compounds like it in BindingDB:
Activity Spreadsheet -- Enzyme Inhibition Constant Data from BindingDB
Found 2 hits for monomerid = 104707
TargetOrexin receptor type 2(Rattus norvegicus (Rat))
Merch Sharp & Dohme
US Patent
LigandPNGBDBM104707(US8569311, 1-34)
Affinity DataKi:  0.680nM. Assay description: Radioligand binding assay described in Bergman et. al. Bioorg. Med. Chem. Lett. 2008, 18, 1425-1430.
In DepthDetails US Patent
TargetOrexin/Hypocretin receptor type 1(Rattus norvegicus (Rat))
Merch Sharp & Dohme
US Patent
LigandPNGBDBM104707(US8569311, 1-34)
Affinity DataKi:  8.20nM. Assay description: Radioligand binding assay described in Bergman et. al. Bioorg. Med. Chem. Lett. 2008, 18, 1425-1430.
In DepthDetails US Patent