BDBM109746 US8618303, 36
SMILES CN([C@@H]1CN(C[C@@]1(C)c1ccc(Cl)cc1)C(=O)c1ccc(cc1)N1CCCCC1=O)C(=O)Oc1ccc(F)cc1
InChI Key InChIKey=AMXZZYNDDNSEEE-JOMNFKBKSA-N
Data  1 KI
  Tab Delimited (TSV)   2D SDfile   Computed 3D by Vconf -m prep SDfile
Find this compound or compounds like it in BindingDB:
Activity Spreadsheet -- Enzyme Inhibition Constant Data from BindingDB
Found 1 hit for monomerid = 109746
TargetNeuromedin-K receptor(Homo sapiens (Human))
Hoffmann-La Roche
US Patent
LigandPNGBDBM109746(US8618303, 36)
Affinity DataKi:  997nM. Assay description: hNK3 receptor binding experiment were performed using [3H]SR142801 (Catalog No. TRK1035, specific activity: 74.0 Ci/mmol, Amersham, GE Healthcare UK ...
In DepthDetails US Patent