BDBM115093 (2S)-2-(9H-fluoren-9-ylmethoxycarbonylamino)-4-methyl-pentanoic acid::(2S)-2-(9H-fluoren-9-ylmethoxycarbonylamino)-4-methyl-valeric acid::(2S)-2-(9H-fluoren-9-ylmethoxycarbonylamino)-4-methylpentanoic acid::(2S)-2-[[9H-fluoren-9-ylmethoxy(oxo)methyl]amino]-4-methylpentanoic acid::Fmoc-L-leucine::MLS002695993::SMR001562137::cid_1549133
SMILES CC(C)C[C@H](NC(=O)OCC1c2ccccc2-c2ccccc12)C(O)=O
InChI Key InChIKey=CBPJQFCAFFNICX-IBGZPJMESA-N
Data  1 KI  1 IC50  1 EC50
  Tab Delimited (TSV)   2D SDfile   Computed 3D by Vconf -m prep SDfile
Find this compound or compounds like it in BindingDB:
Activity Spreadsheet -- Enzyme Inhibition Constant Data from BindingDB
Found 3 hits for monomerid = 115093
TargetSialin(Homo sapiens)
Universit£
Curated by ChEMBL
LigandPNGBDBM115093((2S)-2-(9H-fluoren-9-ylmethoxycarbonylamino)-4-met...)
Affinity DataKi:  1.02E+4nM. Assay description: Non-competitive inhibition of human recombinant-Sialin expressed in HEK293 cells assessed as reduction in [3H]Neu5Ac uptake incubated for 15 mins by ...
In DepthDetails ArticlePubMed
TargetOxysterols receptor LXR-beta(Homo sapiens (Human))
The Scripps Research Institute Molecular Screening Center
Curated by PubChem BioAssay
LigandPNGBDBM115093((2S)-2-(9H-fluoren-9-ylmethoxycarbonylamino)-4-met...)
Affinity DataEC50:  6.75E+4nM. Assay description: Source (MLPCN Center Name): The Scripps Research Institute Molecular Screening Center Affiliation: UT Southwestern Assay Provider: David Mangelsdorf,...
In DepthDetails PCBioAssay
TargetSialin(Homo sapiens)
Universit£
Curated by ChEMBL
LigandPNGBDBM115093((2S)-2-(9H-fluoren-9-ylmethoxycarbonylamino)-4-met...)
Affinity DataIC50:  2.33E+4nM. Assay description: Inhibition of human recombinant-Sialin expressed in HEK293 cells assessed as reduction in [3H]Neu5Ac uptake at 30 to 300 uM incubated for 15 mins by ...
In DepthDetails ArticlePubMed