BDBM118741 US9682940, 147
SMILES CNC(=O)c1ccc(cc1OC)S(=O)(=O)N1CCC(CC1)c1n(nc2ccc(cc12)C(c1ccc(Cl)cc1)c1ccc(Cl)cc1)C1CC1
InChI Key InChIKey=AGFWCFSZHJHACI-UHFFFAOYSA-N
Data  2 EC50
  Tab Delimited (TSV)   2D SDfile   Computed 3D by Vconf -m prep SDfile
Find this compound or compounds like it in BindingDB:
Activity Spreadsheet -- Enzyme Inhibition Constant Data from BindingDB
Found 2 hits for monomerid = 118741
TargetCannabinoid receptor 2(Homo sapiens (Human))
Janssen Pharmaceutica
US Patent
LigandPNGBDBM118741(US9682940, 147)
Affinity DataEC50: >1.00E+4nM. Assay description: CB1 and CB2 receptors are Gi-coupled GPCR. Activation of CB1 and CB2 receptors results in a decrease in cAMP production. An inverse agonist of the CB...
Ligand InfoPC cidPC sid
In DepthDetails US Patent
TargetCannabinoid receptor 1(Homo sapiens (Human))
Janssen Pharmaceutica
US Patent
LigandPNGBDBM118741(US9682940, 147)
Affinity DataEC50:  23nM. Assay description: CB1 and CB2 receptors are Gi-coupled GPCR. Activation of CB1 and CB2 receptors results in a decrease in cAMP production. An inverse agonist of the CB...
Ligand InfoPC cidPC sid
In DepthDetails US Patent