BDBM12076 (2R)-2-{[4-(4-bromophenyl)benzene]sulfonamido}-N-hydroxy-3-methylbutanamide::CHEMBL433262::alpha-arylsulfonylamino hydroxamate 3R
SMILES CC(C)[C@@H](NS(=O)(=O)c1ccc(cc1)-c1ccc(Br)cc1)C(=O)NO
InChI Key InChIKey=VHCRBJFCQRNNFG-MRXNPFEDSA-N
Data  8 IC50
  Tab Delimited (TSV)   2D SDfile   Computed 3D by Vconf -m prep SDfile
Find this compound or compounds like it in BindingDB:
Activity Spreadsheet -- Enzyme Inhibition Constant Data from BindingDB
Found 8 hits for monomerid = 12076
Target72 kDa type IV collagenase(Homo sapiens (Human))
Istituto Di Cristallografia
LigandPNGBDBM12076((2R)-2-{[4-(4-bromophenyl)benzene]sulfonamido}-N-h...)
Affinity DataIC50:  3nMpH: 7.0 T: 2°C. Assay description: Inhibition of the matrix metalloproteinases MMP-2, MMP-3, and MMP-8 has been determined by continuously monitoring the hydrolysis of the fluorescent ...
In DepthDetails ArticlePubMed
TargetStromelysin-1(Homo sapiens (Human))
Istituto Di Cristallografia
LigandPNGBDBM12076((2R)-2-{[4-(4-bromophenyl)benzene]sulfonamido}-N-h...)
Affinity DataIC50:  8nMpH: 6.0 T: 2°C. Assay description: Inhibition of the matrix metalloproteinases MMP-2, MMP-3, and MMP-8 has been determined by continuously monitoring the hydrolysis of the fluorescent ...
In DepthDetails ArticlePubMed
TargetMatrix metalloproteinase-9(Homo sapiens (Human))
Parke-Davis Pharmaceutical Research
Curated by ChEMBL
LigandPNGBDBM12076((2R)-2-{[4-(4-bromophenyl)benzene]sulfonamido}-N-h...)
Affinity DataIC50:  18nM. Assay description: In vitro inhibition of matrix metalloprotease-9 (MMP-9)
In DepthDetails ArticlePubMed
TargetInterstitial collagenase(Homo sapiens (Human))
Parke-Davis Pharmaceutical Research
Curated by ChEMBL
LigandPNGBDBM12076((2R)-2-{[4-(4-bromophenyl)benzene]sulfonamido}-N-h...)
Affinity DataIC50:  110nM. Assay description: In vitro inhibition of human recombinant matrix metalloprotease-1 (MMP-1)
In DepthDetails ArticlePubMed
TargetMatrilysin(Homo sapiens (Human))
Parke-Davis Pharmaceutical Research
Curated by ChEMBL
LigandPNGBDBM12076((2R)-2-{[4-(4-bromophenyl)benzene]sulfonamido}-N-h...)
Affinity DataIC50:  140nM. Assay description: In vitro inhibition of matrix metalloprotease-7 (MMP-7)
In DepthDetails ArticlePubMed
TargetCollagenase 3(Homo sapiens (Human))
Parke-Davis Pharmaceutical Research
Curated by ChEMBL
LigandPNGBDBM12076((2R)-2-{[4-(4-bromophenyl)benzene]sulfonamido}-N-h...)
Affinity DataIC50:  2nM. Assay description: In vitro inhibition of human recombinant matrix metalloprotease-13 (MMP-13)
In DepthDetails ArticlePubMed
Target72 kDa type IV collagenase(Homo sapiens (Human))
Istituto Di Cristallografia
LigandPNGBDBM12076((2R)-2-{[4-(4-bromophenyl)benzene]sulfonamido}-N-h...)
Affinity DataIC50:  1nM. Assay description: In vitro inhibition of matrix metalloprotease-2 (MMP-2)
In DepthDetails ArticlePubMed
TargetStromelysin-1(Homo sapiens (Human))
Istituto Di Cristallografia
LigandPNGBDBM12076((2R)-2-{[4-(4-bromophenyl)benzene]sulfonamido}-N-h...)
Affinity DataIC50:  5nM. Assay description: In vitro inhibition of recombinant human matrix metalloprotease-3 (MMP-3)
In DepthDetails ArticlePubMed