BDBM123513 US8748435, 38
SMILES CCc1nn2c(C)cc(C)nc2c1Cc1ccc(cc1)-c1nnc(o1)C1CCN(CC1)C(=O)[C@H](CO)NC
InChI Key InChIKey=ZVDIRDYLOZQUEA-DEOSSOPVSA-N
Data  1 IC50
  Tab Delimited (TSV)   2D SDfile   Computed 3D by Vconf -m prep SDfile
Find this compound or compounds like it in BindingDB:
Activity Spreadsheet -- Enzyme Inhibition Constant Data from BindingDB
Found 1 hit for monomerid = 123513
TargetG-protein coupled receptor 4(Homo sapiens (Human))
Novartis
US Patent
LigandPNGBDBM123513(US8748435, 38)
Affinity DataIC50:  15nMpH: 8.0Assay Description:Serial dilutions of compounds (stock in 10 mM DMSO) are prepared by first diluting the compounds in DMSO followed by a 1:50 dilution into assay buffe...
In DepthDetails US Patent