BDBM123532 US8748624, 17
SMILES CN(Cc1ccc(Cl)cc1-c1ccc(nc1)C(=O)NCCC(O)=O)c1ccc(cc1)-c1ccc(Cl)cc1
InChI Key InChIKey=BBQZOEDRERJFHQ-UHFFFAOYSA-N
Data  1 KI
  Tab Delimited (TSV)   2D SDfile   Computed 3D by Vconf -m prep SDfile
Find this compound or compounds like it in BindingDB:
Activity Spreadsheet -- Enzyme Inhibition Constant Data from BindingDB
Found 1 hit for monomerid = 123532
TargetGlucagon receptor(Homo sapiens (Human))
Janssen Pharmaceutica
US Patent
LigandPNGBDBM123532(US8748624, 17)
Affinity DataKi:  1.48E+3nMpH: 7.4Assay Description:The binding assay was performed by a filtration method in a 384 well format. Membranes at a final protein concentration of 6 μg/well were incuba...
In DepthDetails US Patent