BDBM129409 US8802673, 51
SMILES Clc1nc2ccccc2cc1CNc1ccc(cc1)[C@H]1CNCCO1
InChI Key InChIKey=BQDOGNWVKQRWBL-LJQANCHMSA-N
Data  2 KI
  Tab Delimited (TSV)   2D SDfile   Computed 3D by Vconf -m prep SDfile
Find this compound or compounds like it in BindingDB:
Activity Spreadsheet -- Enzyme Inhibition Constant Data from BindingDB
Found 2 hits for monomerid = 129409
TargetTrace amine-associated receptor 1(Mus musculus (Mouse))
Hoffmann-La Roche
US Patent
LigandPNGBDBM129409(US8802673, 51)
Affinity DataKi:  36.3nM ΔG°:  -10.6kcal/molepH: 7.4 T: 2°C. Assay description: HEK-293 cells stably expressing rat TAAR1 were maintained at 37 C. and 5% CO2 in DMEM high glucose medium, containing fetal calf serum (10%, heat ina...
Ligand InfoPC cidPC sid
In DepthDetails US Patent
TargetTrace amine-associated receptor 7b(Rattus norvegicus (Rat))
Hoffmann-La Roche
US Patent
LigandPNGBDBM129409(US8802673, 51)
Affinity DataKi:  280nM ΔG°:  -9.29kcal/molepH: 7.4 T: 2°C. Assay description: HEK-293 cells stably expressing mouse TAAR1 were maintained at 37 C. and 5% CO2 in DMEM high glucose medium, containing fetal calf serum (10%, heat i...
Ligand InfoPC cidPC sid
In DepthDetails US Patent