BDBM136348 US8859534, 34
SMILES Cc1ncc(CNC(=O)c2cc3cccc(N4CCN(CCc5ccccn5)CC4)c3o2)cn1
InChI Key InChIKey=MZZSMGOVCAPEFV-UHFFFAOYSA-N
Data  2 KI
  Tab Delimited (TSV)   2D SDfile   Computed 3D by Vconf -m prep SDfile
Find this compound or compounds like it in BindingDB:
Activity Spreadsheet -- Enzyme Inhibition Constant Data from BindingDB
Found 2 hits for monomerid = 136348
Target5-hydroxytryptamine receptor 1A(Cricetulus griseus (Chinese hamster) (Cricetulus b...)
Acturum Life Science
US Patent
LigandPNGBDBM136348(US8859534, 34)
Affinity DataKi:  3.80nMpH: 7.4Assay Description:Assays that were used to measure affinity of the compounds of the present invention for 5-HT1A and 5-HT1B receptors are described in J. Recept Signal...
In DepthDetails US Patent
Target5-hydroxytryptamine receptor 1B(Cricetulus griseus (Chinese hamster) (Cricetulus b...)
Acturum Life Science
US Patent
LigandPNGBDBM136348(US8859534, 34)
Affinity DataKi:  38nMpH: 7.4Assay Description:Assays that were used to measure affinity of the compounds of the present invention for 5-HT1A and 5-HT1B receptors are described in J. Recept Signal...
In DepthDetails US Patent