BDBM143760 US10183953, Example 21::US8969352, 21::US9611277, Example 21::US9845333, 21
SMILES FC(F)(F)c1ccc(OC2CC3CC2N(C3)C(=O)c2ccccc2-n2cnnc2)nc1
InChI Key InChIKey=CTAUDMRXJCJSKS-UHFFFAOYSA-N
Data  12 KI
  Tab Delimited (TSV)   2D SDfile   Computed 3D by Vconf -m prep SDfile
Find this compound or compounds like it in BindingDB:
Activity Spreadsheet -- Enzyme Inhibition Constant Data from BindingDB
Found 12 hits for monomerid = 143760
TargetOrexin/Hypocretin receptor type 1(Rattus norvegicus (Rat))
Janssen Pharmaceutica
US Patent
LigandPNGBDBM143760(US10183953, Example 21 | US8969352, 21 | US9611277...)
Affinity DataKi: >1.00E+4nM ΔG°: >-6.34kcal/moleT: 2°C. Assay description: Human Embryonic Kidney 293 cells (HEK293) stably expressing rat orexin 1 receptor (Genebank accession number NM 001525) or Chinese ovary cells (CHO) ...
Ligand InfoPC cidPC sid
In DepthDetails US Patent
TargetOrexin receptor type 2(Homo sapiens (Human))
Janssen Pharmaceutica
US Patent
LigandPNGBDBM143760(US10183953, Example 21 | US8969352, 21 | US9611277...)
Affinity DataKi: >1.00E+4nM. Assay description: HEK293 stably expressing human orexin 2 receptor (Genebank accession number NM 001526) were grown to confluency in DMEM (Hyclone, cat # SH30022), 10%...
Ligand InfoPC cidPC sid
In DepthDetails US Patent
TargetOrexin/Hypocretin receptor type 1(Rattus norvegicus (Rat))
Janssen Pharmaceutica
US Patent
LigandPNGBDBM143760(US10183953, Example 21 | US8969352, 21 | US9611277...)
Affinity DataKi: >1.00E+4nM. Assay description: Human Embryonic Kidney 293 cells (HEK293) stably expressing rat orexin 1 receptor (Genebank accession number NM_001525) or Chinese ovary cells (CHO) ...
Ligand InfoPC cidPC sid
In DepthDetails US Patent
TargetOrexin receptor type 2(Homo sapiens (Human))
Janssen Pharmaceutica
US Patent
LigandPNGBDBM143760(US10183953, Example 21 | US8969352, 21 | US9611277...)
Affinity DataKi: >1.00E+4nM. Assay description: HEK293 stably expressing human orexin 2 receptor (Genebank accession number NM_001526) were grown to confluency in DMEM (Hyclone, cat # SH30022), 10%...
Ligand InfoPC cidPC sid
In DepthDetails US Patent
TargetOrexin/Hypocretin receptor type 1(Rattus norvegicus (Rat))
Janssen Pharmaceutica
US Patent
LigandPNGBDBM143760(US10183953, Example 21 | US8969352, 21 | US9611277...)
Affinity DataKi: >1.00E+4nM. Assay description: Human Embryonic Kidney 293 cells (HEK293) stably expressing rat orexin 1 receptor (Genebank accession number NM_001525) or Chinese ovary cells (CHO) ...
Ligand InfoPC cidPC sid
In DepthDetails US Patent
TargetOrexin receptor type 2(Rattus norvegicus (Rat))
TBA
US Patent
LigandPNGBDBM143760(US10183953, Example 21 | US8969352, 21 | US9611277...)
Affinity DataKi: >1.00E+4nM. Assay description: Human Orexin 2 Receptor:HEK293 stably expressing human orexin 2 receptor (Genebank accession number NM_001526) were grown to confluency in DMEM (Hycl...
Ligand InfoPC cidPC sid
In DepthDetails US Patent
TargetOrexin/Hypocretin receptor type 1(Rattus norvegicus (Rat))
Janssen Pharmaceutica
US Patent
LigandPNGBDBM143760(US10183953, Example 21 | US8969352, 21 | US9611277...)
Affinity DataKi: >1.00E+4nM. Assay description: Human Embryonic Kidney 293 cells (HEK293) stably expressing rat orexin 1 receptor (Genebank accession number NM_001525) or Chinese ovary cells (CHO) ...
Ligand InfoPC cidPC sid
In DepthDetails US Patent
TargetOrexin receptor type 2(Homo sapiens (Human))
Janssen Pharmaceutica
US Patent
LigandPNGBDBM143760(US10183953, Example 21 | US8969352, 21 | US9611277...)
Affinity DataKi: >1.00E+4nM. Assay description: PFSK-1 cells endogenously expressing the human orexin 2 receptor were grown to confluency in RPMI1640 (Hyclone, cat #30027.02), 10% FBS, 1× pen-strep...
Ligand InfoPC cidPC sid
In DepthDetails US Patent
TargetOrexin/Hypocretin receptor type 1(Rattus norvegicus (Rat))
Janssen Pharmaceutica
US Patent
LigandPNGBDBM143760(US10183953, Example 21 | US8969352, 21 | US9611277...)
Affinity DataKi: >1.00E+4nM. Assay description: Human Embryonic Kidney 293 cells (HEK293) stably expressing rat orexin 1 receptor (Genebank accession number NM_001525) or Chinese ovary cells (CHO) ...
Ligand InfoPC cidPC sid
In DepthDetails US Patent
TargetOrexin receptor type 2(Homo sapiens (Human))
Janssen Pharmaceutica
US Patent
LigandPNGBDBM143760(US10183953, Example 21 | US8969352, 21 | US9611277...)
Affinity DataKi: >1.00E+4nM. Assay description: PFSK-1 cells endogenously expressing the human orexin 2 receptor were grown to confluency in RPMI1640 (Hyclone, cat #30027.02), 10% FBS, 1× pen-strep...
Ligand InfoPC cidPC sid
In DepthDetails US Patent
TargetOrexin/Hypocretin receptor type 1(Rattus norvegicus (Rat))
Janssen Pharmaceutica
US Patent
LigandPNGBDBM143760(US10183953, Example 21 | US8969352, 21 | US9611277...)
Affinity DataKi: >1.00E+4nM. Assay description: Rat and Human Orexin 1 Receptor:Human Embryonic Kidney 293 cells (HEK293) stably expressing rat orexin 1 receptor (Genebank accession number NM_00152...
Ligand InfoPC cidPC sid
In DepthDetails US Patent
TargetOrexin receptor type 2(Homo sapiens (Human))
Janssen Pharmaceutica
US Patent
LigandPNGBDBM143760(US10183953, Example 21 | US8969352, 21 | US9611277...)
Affinity DataKi: >1.00E+4nM. Assay description: HEK293 stably expressing human orexin 2 receptor (Genebank accession number NM_001526) were grown to confluency in DMEM (Hyclone, cat # SH30022), 10%...
Ligand InfoPC cidPC sid
In DepthDetails US Patent