BDBM160190 US9040663, 36
SMILES C[C@@H](O)[C@@H]1NC(=O)[C@H](CCC(=O)NCCC[C@H](NC(=O)[C@H](Cc2c[nH]c3ccccc23)NC(=O)[C@H](CCCNC(N)=N)NC(=O)[C@@H](Cc2cccc(Cl)c2)NC1=O)C(N)=O)NC(=O)[C@H](CCCNC(N)=N)NC(C)=O
InChI Key
Data  2 KI
  Tab Delimited (TSV)   2D SDfile   Computed 3D by Vconf -m prep SDfile
Find this compound or compounds like it in BindingDB:
Activity Spreadsheet -- Enzyme Inhibition Constant Data from BindingDB
Found 2 hits for monomerid = 160190
TargetMelanocortin receptor 4(Homo sapiens (Human))
Astrazeneca
US Patent
LigandPNGBDBM160190(US9040663, 36)
Affinity DataKi:  6nM ΔG°:  -11.7kcal/molepH: 7.5 T: 2°C. Assay description: A competitive inhibition binding assay was performed for exemplified peptides according to the invention using membrane homogenates prepared from HEK...
In DepthDetails US Patent
TargetMelanocyte-stimulating hormone receptor(Homo sapiens (Human))
Astrazeneca
US Patent
LigandPNGBDBM160190(US9040663, 36)
Affinity DataKi:  380nM ΔG°:  -9.10kcal/molepH: 7.5 T: 2°C. Assay description: A competitive inhibition binding assay was performed for exemplified peptides according to the invention using membrane homogenates prepared from HEK...
In DepthDetails US Patent