BDBM163372 US9062048, 40
SMILES FC(F)(F)c1ccc2ncnc(NCC(=O)NC3CN(C3)C3CCC(CC3)N3CCCC3=O)c2c1
InChI Key InChIKey=RDGFHBPSDVQZEM-UHFFFAOYSA-N
Data  1 IC50
  Tab Delimited (TSV)   2D SDfile   Computed 3D by Vconf -m prep SDfile
Find this compound or compounds like it in BindingDB:
Activity Spreadsheet -- Enzyme Inhibition Constant Data from BindingDB
Found 1 hit for monomerid = 163372
TargetC-C chemokine receptor-like 2(Homo sapiens (Human))
Janssen Pharmaceutica
US Patent
LigandPNGBDBM163372(US9062048, 40)
Affinity DataIC50:  78nM. Assay description: Human monocytic cell line THP-1 cells were obtained from American Type Culture Collection (Manassas, Va., USA). The THP-1 cells were grown in RPMI-16...
In DepthDetails US Patent