BDBM163939 US9062078, 70::US9475819, 70::US9637496, 70::US9695183, 70
SMILES Cc1ccc(c(n1)C(=O)N1C2CCC1C(COc1ccc(F)cn1)C2)-n1cccn1
InChI Key InChIKey=FVRBZEZQMMWCNM-UHFFFAOYSA-N
Data  12 KI
  Tab Delimited (TSV)   2D SDfile   Computed 3D by Vconf -m prep SDfile
Find this compound or compounds like it in BindingDB:
Activity Spreadsheet -- Enzyme Inhibition Constant Data from BindingDB
Found 12 hits for monomerid = 163939
TargetOrexin/Hypocretin receptor type 1(Homo sapiens (Human))
Janssen Pharmaceutica
US Patent
LigandPNGBDBM163939(US9062078, 70 | US9475819, 70 | US9637496, 70 | US...)
Affinity DataKi:  62nM ΔG°:  -9.13kcal/moleT: 2°C. Assay description: Human Embryonic Kidney 293 cells (HEK293) stably expressing rat orexin 1 receptor (Genebank accession number NM_001525) or Chinese ovary cells (CHO) ...
In DepthDetails US Patent
TargetOrexin/Hypocretin receptor type 1(Homo sapiens (Human))
Janssen Pharmaceutica
US Patent
LigandPNGBDBM163939(US9062078, 70 | US9475819, 70 | US9637496, 70 | US...)
Affinity DataKi:  62nM. Assay description: Human Embryonic Kidney 293 cells (HEK293) stably expressing rat orexin 1 receptor (Genebank accession number NM_001525) or Chinese ovary cells (CHO) ...
In DepthDetails US Patent
TargetOrexin/Hypocretin receptor type 1(Homo sapiens (Human))
Janssen Pharmaceutica
US Patent
LigandPNGBDBM163939(US9062078, 70 | US9475819, 70 | US9637496, 70 | US...)
Affinity DataKi:  62nM ΔG°:  -9.13kcal/moleT: 2°C. Assay description: Human Embryonic Kidney 293 cells (HEK293) stably expressing rat orexin 1 receptor (Genebank accession number NM001525) or Chinese ovary cells (CHO) s...
In DepthDetails US Patent
TargetOrexin/Hypocretin receptor type 1(Homo sapiens (Human))
Janssen Pharmaceutica
US Patent
LigandPNGBDBM163939(US9062078, 70 | US9475819, 70 | US9637496, 70 | US...)
Affinity DataKi:  62nM ΔG°:  -9.13kcal/moleT: 2°C. Assay description: Human Embryonic Kidney 293 cells (HEK293) stably expressing rat orexin 1 receptor (Genebank accession number NM_001525) or Chinese ovary cells (CHO) ...
In DepthDetails US Patent
TargetOrexin/Hypocretin receptor type 1(Rattus norvegicus (Rat))
Janssen Pharmaceutica
US Patent
LigandPNGBDBM163939(US9062078, 70 | US9475819, 70 | US9637496, 70 | US...)
Affinity DataKi:  88nM ΔG°:  -10.1kcal/moleT: 2°C. Assay description: HEK293 stably expressing human orexin 2 receptor (Genebank accession number NM001526) were grown to confluency in DMEM (Hyclone, cat #SH30022), 10% F...
In DepthDetails US Patent
TargetOrexin/Hypocretin receptor type 1(Rattus norvegicus (Rat))
Janssen Pharmaceutica
US Patent
LigandPNGBDBM163939(US9062078, 70 | US9475819, 70 | US9637496, 70 | US...)
Affinity DataKi:  88nM ΔG°:  -8.94kcal/moleT: 2°C. Assay description: Human Embryonic Kidney 293 cells (HEK293) stably expressing rat orexin 1 receptor (Genebank accession number NM_001525) or Chinese ovary cells (CHO) ...
In DepthDetails US Patent
TargetOrexin/Hypocretin receptor type 1(Rattus norvegicus (Rat))
Janssen Pharmaceutica
US Patent
LigandPNGBDBM163939(US9062078, 70 | US9475819, 70 | US9637496, 70 | US...)
Affinity DataKi:  88nM. Assay description: Human Embryonic Kidney 293 cells (HEK293) stably expressing rat orexin 1 receptor (Genebank accession number NM_001525) or Chinese ovary cells (CHO) ...
In DepthDetails US Patent
TargetOrexin/Hypocretin receptor type 1(Rattus norvegicus (Rat))
Janssen Pharmaceutica
US Patent
LigandPNGBDBM163939(US9062078, 70 | US9475819, 70 | US9637496, 70 | US...)
Affinity DataKi:  88nM ΔG°:  -8.94kcal/moleT: 2°C. Assay description: Human Embryonic Kidney 293 cells (HEK293) stably expressing rat orexin 1 receptor (Genebank accession number NM_001525) or Chinese ovary cells (CHO) ...
In DepthDetails US Patent
TargetOrexin receptor type 2(Homo sapiens (Human))
Janssen Pharmaceutica
US Patent
LigandPNGBDBM163939(US9062078, 70 | US9475819, 70 | US9637496, 70 | US...)
Affinity DataKi:  624nM ΔG°:  -8.88kcal/moleT: 2°C. Assay description: HEK293 stably expressing human orexin 2 receptor (Genebank accession number NM_001526) were grown to confluency in DMEM (Hyclone, cat # SH30022), 10%...
In DepthDetails US Patent
TargetOrexin receptor type 2(Homo sapiens (Human))
Janssen Pharmaceutica
US Patent
LigandPNGBDBM163939(US9062078, 70 | US9475819, 70 | US9637496, 70 | US...)
Affinity DataKi:  624nM ΔG°:  -8.88kcal/moleT: 2°C. Assay description: HEK293 stably expressing human orexin 2 receptor (Genebank accession number NM_001526) were grown to confluency in DMEM (Hyclone, cat #SH30022), 10% ...
In DepthDetails US Patent
TargetOrexin receptor type 2(Homo sapiens (Human))
Janssen Pharmaceutica
US Patent
LigandPNGBDBM163939(US9062078, 70 | US9475819, 70 | US9637496, 70 | US...)
Affinity DataKi:  624nM ΔG°:  -8.88kcal/moleT: 2°C. Assay description: HEK293 stably expressing human orexin 2 receptor (Genebank accession number NM001526) were grown to confluency in DMEM (Hyclone, cat #SH30022), 10% F...
In DepthDetails US Patent
TargetOrexin receptor type 2(Homo sapiens (Human))
Janssen Pharmaceutica
US Patent
LigandPNGBDBM163939(US9062078, 70 | US9475819, 70 | US9637496, 70 | US...)
Affinity DataKi:  624nM. Assay description: HEK293 stably expressing human orexin 2 receptor (Genebank accession number NM_001526) were grown to confluency in DMEM (Hyclone, cat #SH30022), 10% ...
In DepthDetails US Patent