BDBM166171 US9067949, 28
SMILES O=S(=O)(c1ccccc1)c1ccc2oc3CCNCc3c2c1
InChI Key InChIKey=AGJMBLMVRSXPOC-UHFFFAOYSA-N
Data  1 KI
  Tab Delimited (TSV)   2D SDfile   Computed 3D by Vconf -m prep SDfile
Find this compound or compounds like it in BindingDB:
Activity Spreadsheet -- Enzyme Inhibition Constant Data from BindingDB
Found 1 hit for monomerid = 166171
Target5-hydroxytryptamine receptor 6(Homo sapiens (Human))
Albany Molecular Research
US Patent
LigandPNGBDBM166171(US9067949, 28)
Affinity DataKi:  19nM ΔG°:  -10.5kcal/molepH: 7.5 T: 2°C. Assay description: For binding analysis vs. the human receptor, samples were incubated in 50 mM Tris-HCl, pH 7.5, 5 mM MgCl2, 1 mM EDTA (4% DMSO final) with 10 nM [N-me...
In DepthDetails US Patent