BDBM168197 US9688642, 45
SMILES COc1ccc(F)c(c1)-c1ncc(COc2cccc(c2)[C@@H](CC(O)=O)C2CC2)nc1N1CCOCC1
InChI Key InChIKey=IFVQUUXKGCQMQJ-QHCPKHFHSA-N
Data  2 EC50
  Tab Delimited (TSV)   2D SDfile   Computed 3D by Vconf -m prep SDfile
Find this compound or compounds like it in BindingDB:
Activity Spreadsheet -- Enzyme Inhibition Constant Data from BindingDB
Found 2 hits for monomerid = 168197
TargetFree fatty acid receptor 1(Rattus norvegicus)
Janssen Pharmaceutica
US Patent
LigandPNGBDBM168197(US9688642, 45)
Affinity DataEC50:  136nMT: 2°C. Assay description: Compounds were tested in a calcium flux assay using transfected HEK293 cells stably expressing either human GPR40 or rat GPR40. Human GPR40 expressin...
Ligand InfoPC cidPC sid
In DepthDetails US Patent
TargetFree fatty acid receptor 1(Homo sapiens (Human))
Janssen Pharmaceutica
US Patent
LigandPNGBDBM168197(US9688642, 45)
Affinity DataEC50:  34nMT: 2°C. Assay description: Compounds were tested in a calcium flux assay using transfected HEK293 cells stably expressing either human GPR40 or rat GPR40. Human GPR40 expressin...
Ligand InfoPC cidPC sid
In DepthDetails US Patent