BDBM172335 US9090596, 15
SMILES Cc1ccc(o1)C(Nc1c(Nc2cccc(C(=O)N3CCOCC3)c2O)c(=O)c1=O)C1(C)COC1
InChI Key InChIKey=GENDPWSLDZSRJG-UHFFFAOYSA-N
Data  2 IC50
  Tab Delimited (TSV)   2D SDfile   Computed 3D by Vconf -m prep SDfile
Find this compound or compounds like it in BindingDB:
Activity Spreadsheet -- Enzyme Inhibition Constant Data from BindingDB
Found 2 hits for monomerid = 172335
TargetC-X-C chemokine receptor type 2(Homo sapiens (Human))
Galderma Research & Development
US Patent
LigandPNGBDBM172335(US9090596, 15)
Affinity DataIC50:  626nM. Assay description: The in vitro affinity of the compounds of the present invention for the CXCR1 and CXCR2 receptors was determined on a functional test of the .beta.-a...
In DepthDetails US Patent
TargetC-X-C chemokine receptor type 1(Homo sapiens (Human))
Galderma Research & Development
US Patent
LigandPNGBDBM172335(US9090596, 15)
Affinity DataIC50:  3.17E+3nM. Assay description: The in vitro affinity of the compounds of the present invention for the CXCR1 and CXCR2 receptors was determined on a functional test of the .beta.-a...
In DepthDetails US Patent