BDBM192833 US9192603, 6
SMILES Clc1ccc(CS(=O)(=O)c2cnc(NC(=O)c3ccccn3)s2)c(Cl)c1
InChI Key InChIKey=ABKYTSSASLYMLC-UHFFFAOYSA-N
Data  1 EC50
  Tab Delimited (TSV)   2D SDfile   Computed 3D by Vconf -m prep SDfile
Find this compound or compounds like it in BindingDB:
Activity Spreadsheet -- Enzyme Inhibition Constant Data from BindingDB
Found 1 hit for monomerid = 192833
TargetMetabotropic glutamate receptor 4(Homo sapiens (Human))
Vanderbilt University
US Patent
LigandPNGBDBM192833(US9192603, 6)
Affinity DataEC50:  49.9nM. Assay description: The disclosed compounds and compositions can be evaluated for their ability to act as a potentiator of metabotropic glutamate receptor activity, in p...
In DepthDetails US Patent