BDBM196221 US9670220, 211
SMILES OC(=O)CCCN1CCc2oc(nc2C1)-c1ccc(OCc2ccc(Cl)cc2)cc1F
InChI Key InChIKey=FLCOYXRNFCJQIB-UHFFFAOYSA-N
Data  3 EC50
  Tab Delimited (TSV)   2D SDfile   Computed 3D by Vconf -m prep SDfile
Find this compound or compounds like it in BindingDB:
Activity Spreadsheet -- Enzyme Inhibition Constant Data from BindingDB
Found 3 hits for monomerid = 196221
TargetSphingosine 1-phosphate receptor 5(Homo sapiens (Human))
Abbvie
US Patent
LigandPNGBDBM196221(US9670220, 211)
Affinity DataEC50:  5nM. Assay description: The CHO-human-S1P5-Aeqorin assay was bought from Euroscreen, Brussels (Euroscreen, Technical dossier, Human Lysophospholid S1P5 (Edg8) receptor, DNA ...
Ligand InfoPC cidPC sid
In DepthDetails US Patent
TargetSphingosine 1-phosphate receptor 3(Homo sapiens (Human))
Abbvie
US Patent
LigandPNGBDBM196221(US9670220, 211)
Affinity DataEC50: >1.00E+4nM. Assay description: The CHO-human-S1P3-Aeqorin assay (CHO/Gα16/AEQ/h-S1P3) was established at Solvay Pharmaceuticals. The plasmid DNA coding for the S1P3 receptor (...
Ligand InfoPC cidPC sid
In DepthDetails US Patent
TargetSphingosine 1-phosphate receptor 1(Homo sapiens (Human))
Abbvie
US Patent
LigandPNGBDBM196221(US9670220, 211)
Affinity DataEC50:  790nMT: 2°C. Assay description: The CHO-K1-Human S1P1-c-AMP assay was performed at Euroscreenfast, Brussels (Euroscreen, Human S1P1 coupling Gi/0, (Edg1) receptor, catalog no: FAST-...
Ligand InfoPC cidPC sid
In DepthDetails US Patent