BDBM202894 US9242970, 37
SMILES COc1cccc(OC)c1C1CCCC(=O)N1Cc1cccc(c1F)-c1ccccn1
InChI Key InChIKey=AGDHLORZIGVLKC-UHFFFAOYSA-N
Data  2 IC50
  Tab Delimited (TSV)   2D SDfile   Computed 3D by Vconf -m prep SDfile
Find this compound or compounds like it in BindingDB:
Activity Spreadsheet -- Enzyme Inhibition Constant Data from BindingDB
Found 2 hits for monomerid = 202894
TargetOrexin/Hypocretin receptor type 1(Homo sapiens (Human))
Actelion Pharmaceuticals
US Patent
LigandPNGBDBM202894(US9242970, 37)
Affinity DataIC50:  72nMT: 2°C. Assay description: In Vitro Assay: Intracellular Calcium Measurements:Chinese hamster ovary (CHO) cells expressing the human orexin-1 receptor and the human orexin-2 re...
Ligand InfoPC cidPC sid
In DepthDetails US Patent
TargetOrexin receptor type 2(Homo sapiens (Human))
Actelion Pharmaceuticals
US Patent
LigandPNGBDBM202894(US9242970, 37)
Affinity DataIC50:  64nMT: 2°C. Assay description: In Vitro Assay: Intracellular Calcium Measurements:Chinese hamster ovary (CHO) cells expressing the human orexin-1 receptor and the human orexin-2 re...
Ligand InfoPC cidPC sid
In DepthDetails US Patent