BDBM206053 US9255103, 54
SMILES CC(Oc1ccccc1)c1cc2CN(CCn2n1)C(=O)c1ccc(F)cc1
InChI Key InChIKey=ALXDNMSKBLJSRY-UHFFFAOYSA-N
Data  1 EC50
  Tab Delimited (TSV)   2D SDfile   Computed 3D by Vconf -m prep SDfile
Find this compound or compounds like it in BindingDB:
Activity Spreadsheet -- Enzyme Inhibition Constant Data from BindingDB
Found 1 hit for monomerid = 206053
TargetMetabotropic glutamate receptor 5(Homo sapiens (Human))
Vanderbilt University
US Patent
LigandPNGBDBM206053(US9255103, 54)
Affinity DataEC50: >3.02E+4nMpH: 7.4Assay Description:HEK cells transfected with the human mGluR5a receptor (H10H cell line) were plated at 15,000 cells/well in clear-bottomed poly-D-lysine-coated assay ...
Ligand InfoPC cidPC sid
In DepthDetails US Patent