BDBM20992 1-(4-{4-[butyl(ethyl)amino]-2-methyl-5,6,7,8-tetrahydropteridin-8-yl}-3-methylphenyl)ethan-1-one::Pteridine, 5d
SMILES CCCCN(CC)c1nc(C)nc2N(CCNc12)c1ccc(cc1C)C(C)=O
InChI Key InChIKey=CQBYFIKAPGAYHV-UHFFFAOYSA-N
Data  1 IC50
  Tab Delimited (TSV)   2D SDfile   Computed 3D by Vconf -m prep SDfile
Find this compound or compounds like it in BindingDB:
Activity Spreadsheet -- Enzyme Inhibition Constant Data from BindingDB
Found 1 hit for monomerid = 20992
TargetCorticotropin-releasing factor receptor 1(Rattus norvegicus (rat))
Bristol-Myers Squibb
LigandPNGBDBM20992(1-(4-{4-[butyl(ethyl)amino]-2-methyl-5,6,7,8-tetra...)
Affinity DataIC50:  172nMpH: 7.0 T: 2°C. Assay description: The IC50 values were measured by monitoring the inhibition effects of test compounds on [125I]-o-CRF binding to rat cortex in vitro.
In DepthDetails ArticlePubMed