BDBM211021 US9247759, 4-56
SMILES Cc1noc(C)c1Cn1cc(NC(=O)CCCc2ccccc2)cn1
InChI Key InChIKey=HNTRSYYXQUNGEA-UHFFFAOYSA-N
Data  2 IC50
  Tab Delimited (TSV)   2D SDfile   Computed 3D by Vconf -m prep SDfile
Find this compound or compounds like it in BindingDB:
Activity Spreadsheet -- Enzyme Inhibition Constant Data from BindingDB
Found 2 hits for monomerid = 211021
TargetTaste receptor type 2 member 8(Homo sapiens (Human))
Firmenich
Curated by ChEMBL
LigandPNGBDBM211021(US9247759, 4-56)
Affinity DataIC50:  800nM. Assay description: Antagonist activity at recombinant human TAS2R8 stably expressed in cells co-expressing Galpha16gust44 assessed as inhibition of andrographolide-indu...
Ligand InfoPC cidPC sid
In DepthDetails ArticlePubMed
TargetTaste receptor type 2 member 8(Homo sapiens (Human))
Firmenich
Curated by ChEMBL
LigandPNGBDBM211021(US9247759, 4-56)
Affinity DataIC50:  830nM. Assay description: In another embodiment, Fluorescence Polarization ("FP") based assays may be used to detect and monitor ligand binding. Fluorescence polarization is a...
Ligand InfoPC cidPC sid
In DepthDetails US Patent