BDBM211054 US9247759, 4-90
SMILES Cc1noc(C)c1Cn1cc(NC(=O)c2cc3OCCOc3cc2Cl)cn1
InChI Key InChIKey=IEYASGORSUXVMI-UHFFFAOYSA-N
Data  1 IC50
  Tab Delimited (TSV)   2D SDfile   Computed 3D by Vconf -m prep SDfile
Find this compound or compounds like it in BindingDB:
Activity Spreadsheet -- Enzyme Inhibition Constant Data from BindingDB
Found 1 hit for monomerid = 211054
TargetTaste receptor type 2 member 8(Homo sapiens (Human))
Senomyx
US Patent
LigandPNGBDBM211054(US9247759, 4-90)
Affinity DataIC50:  100nM. Assay description: In another embodiment, Fluorescence Polarization ("FP") based assays may be used to detect and monitor ligand binding. Fluorescence polarization is a...
Ligand InfoPC cidPC sid
In DepthDetails US Patent