BDBM211146 US9247759, 5-140::US9247759, 5-80
SMILES Cc1ccccc1CN(Cc1ccccc1)S(=O)(=O)c1ccc(cc1)C(O)=O
InChI Key InChIKey=KLOPYFIVFGFGIW-UHFFFAOYSA-N
Data  2 IC50
  Tab Delimited (TSV)   2D SDfile   Computed 3D by Vconf -m prep SDfile
Find this compound or compounds like it in BindingDB:
Activity Spreadsheet -- Enzyme Inhibition Constant Data from BindingDB
Found 2 hits for monomerid = 211146
TargetTaste receptor type 2 member 14(Homo sapiens (Human))
Senomyx
US Patent
LigandPNGBDBM211146(US9247759, 5-140 | US9247759, 5-80)
Affinity DataIC50:  2.93E+3nM. Assay description: In another embodiment, Fluorescence Polarization ("FP") based assays may be used to detect and monitor ligand binding. Fluorescence polarization is a...
Ligand InfoPC cidPC sid
In DepthDetails US Patent
TargetTaste receptor type 2 member 14(Homo sapiens (Human))
Senomyx
US Patent
LigandPNGBDBM211146(US9247759, 5-140 | US9247759, 5-80)
Affinity DataIC50:  2.93E+3nM. Assay description: In another embodiment, Fluorescence Polarization ("FP") based assays may be used to detect and monitor ligand binding. Fluorescence polarization is a...
Ligand InfoPC cidPC sid
In DepthDetails US Patent