BDBM211214 US9247759, 5-161
SMILES COc1ccc(cc1)C1Cc2ccccc2CN1S(=O)(=O)c1ccc(cc1)C(O)=O
InChI Key InChIKey=QDCJERDRJJAYLT-UHFFFAOYSA-N
Data  1 IC50
  Tab Delimited (TSV)   2D SDfile   Computed 3D by Vconf -m prep SDfile
Find this compound or compounds like it in BindingDB:
Activity Spreadsheet -- Enzyme Inhibition Constant Data from BindingDB
Found 1 hit for monomerid = 211214
TargetTaste receptor type 2 member 14(Homo sapiens (Human))
Senomyx
US Patent
LigandPNGBDBM211214(US9247759, 5-161)
Affinity DataIC50:  6.27E+3nM. Assay description: In another embodiment, Fluorescence Polarization ("FP") based assays may be used to detect and monitor ligand binding. Fluorescence polarization is a...
Ligand InfoPC cidPC sid
In DepthDetails US Patent