BDBM211223 US9247759, 6-20::US9247759, 6-9
SMILES Cc1ccccc1NS(=O)(=O)c1ccc2n(C)c(=O)n(C)c(=O)c2c1
InChI Key InChIKey=UOWMMXGANJHAKM-UHFFFAOYSA-N
Data  2 IC50
  Tab Delimited (TSV)   2D SDfile   Computed 3D by Vconf -m prep SDfile
Find this compound or compounds like it in BindingDB:
Activity Spreadsheet -- Enzyme Inhibition Constant Data from BindingDB
Found 2 hits for monomerid = 211223
TargetTaste receptor type 2 member 14(Homo sapiens (Human))
Senomyx
US Patent
LigandPNGBDBM211223(US9247759, 6-20 | US9247759, 6-9)
Affinity DataIC50:  1.73E+3nM. Assay description: In another embodiment, Fluorescence Polarization ("FP") based assays may be used to detect and monitor ligand binding. Fluorescence polarization is a...
In DepthDetails US Patent
TargetTaste receptor type 2 member 14(Homo sapiens (Human))
Senomyx
US Patent
LigandPNGBDBM211223(US9247759, 6-20 | US9247759, 6-9)
Affinity DataIC50:  1.73E+3nM. Assay description: In another embodiment, Fluorescence Polarization ("FP") based assays may be used to detect and monitor ligand binding. Fluorescence polarization is a...
In DepthDetails US Patent