BDBM211281 US9247759, 10-29
SMILES COc1ccc(CN2CC(=O)N(C2=O)c2cnn(Cc3c(C)noc3C)c2)cc1
InChI Key InChIKey=DOJLUEZEDJOOGV-UHFFFAOYSA-N
Data  1 IC50
  Tab Delimited (TSV)   2D SDfile   Computed 3D by Vconf -m prep SDfile
Find this compound or compounds like it in BindingDB:
Activity Spreadsheet -- Enzyme Inhibition Constant Data from BindingDB
Found 1 hit for monomerid = 211281
TargetTaste receptor type 2 member 8(Homo sapiens (Human))
Senomyx
US Patent
LigandPNGBDBM211281(US9247759, 10-29)
Affinity DataIC50:  70nM. Assay description: In another embodiment, Fluorescence Polarization ("FP") based assays may be used to detect and monitor ligand binding. Fluorescence polarization is a...
Ligand InfoPC cidPC sid
In DepthDetails US Patent