BDBM21387 6-[4-(2-acetamidophenyl)piperazin-1-yl]-N-(1,2,3,4-tetrahydronaphthalen-1-yl)hexanamide::Piperazinehexanamide derivative, 25
SMILES CC(=O)Nc1ccccc1N1CCN(CCCCCC(=O)NC2CCCc3ccccc23)CC1
InChI Key InChIKey=DFLMNRNLACOXKM-UHFFFAOYSA-N
Data  4 KI
  Tab Delimited (TSV)   2D SDfile   Computed 3D by Vconf -m prep SDfile
Find this compound or compounds like it in BindingDB:
Activity Spreadsheet -- Enzyme Inhibition Constant Data from BindingDB
Found 4 hits for monomerid = 21387
Target5-hydroxytryptamine receptor 7(Rattus norvegicus (rat))
Universita Degli Studi Di Bari
LigandPNGBDBM21387(6-[4-(2-acetamidophenyl)piperazin-1-yl]-N-(1,2,3,4...)
Affinity DataKi:  338nM ΔG°:  -9.18kcal/molepH: 7.4 T: 2°C. Assay description: IC50 values for each test compound were determined from nonlinear regression analysis of data collected from ligand binding experiments. The inhibiti...
In DepthDetails ArticlePubMed
TargetD(2) dopamine receptor(Homo sapiens (Human))
Universita Degli Studi Di Bari
LigandPNGBDBM21387(6-[4-(2-acetamidophenyl)piperazin-1-yl]-N-(1,2,3,4...)
Affinity DataKi: >1.00E+3nM. Assay description: IC50 values for each test compound were determined from nonlinear regression analysis of data collected from ligand binding experiments. The inhibiti...
In DepthDetails ArticlePubMed
Target5-hydroxytryptamine receptor 1A(Homo sapiens (Human))
Universita Degli Studi Di Bari
LigandPNGBDBM21387(6-[4-(2-acetamidophenyl)piperazin-1-yl]-N-(1,2,3,4...)
Affinity DataKi:  2.50E+3nM. Assay description: IC50 values for each test compound were determined from nonlinear regression analysis of data collected from ligand binding experiments. The inhibiti...
In DepthDetails ArticlePubMed
Target5-hydroxytryptamine receptor 2A(Rattus norvegicus (rat))
Universita Degli Studi Di Bari
LigandPNGBDBM21387(6-[4-(2-acetamidophenyl)piperazin-1-yl]-N-(1,2,3,4...)
Affinity DataKi:  3.52E+3nM. Assay description: IC50 values for each test compound were determined from nonlinear regression analysis of data collected from ligand binding experiments. The inhibiti...
In DepthDetails ArticlePubMed