BDBM224030 Norcodeine
SMILES [H][C@@]12Oc3c4c(C[C@@]5([H])NCC[C@@]14[C@@]5([H])C=C[C@@H]2O)ccc3OC
InChI Key InChIKey=HKOIXWVRNLGFOR-KOFBORESSA-N
Data  1 EC50
  Tab Delimited (TSV)   2D SDfile   Computed 3D by Vconf -m prep SDfile
Find this compound or compounds like it in BindingDB:
Activity Spreadsheet -- Enzyme Inhibition Constant Data from BindingDB
Found 1 hit for monomerid = 224030
TargetMas-related G-protein coupled receptor member X2(Homo sapiens (Human))
University Of North Carolina
LigandPNGBDBM224030(Norcodeine)
Affinity DataEC50:  1.60E+4nMpH: 7.4 T: 2°C. Assay description: HTLA cells (HEK-T cells stably expressing a β-arrestin2-TEV fusion protein and a tTa-dependent luciferase reporter) were maintained in DMEM (Cor...
In DepthDetails ArticlePubMed