BDBM22488 3-Aryl-3-(4-phenoxy)-propionic Acid derivative, 24::3-[4-(2-ethylbutoxy)phenyl]-3-phenylpropanoic acid
SMILES CCC(CC)COc1ccc(cc1)C(CC(O)=O)c1ccccc1
InChI Key InChIKey=VYGVLDBVEDZHAD-UHFFFAOYSA-N
Data  1 EC50
  Tab Delimited (TSV)   2D SDfile   Computed 3D by Vconf -m prep SDfile
Find this compound or compounds like it in BindingDB:
Activity Spreadsheet -- Enzyme Inhibition Constant Data from BindingDB
Found 1 hit for monomerid = 22488
TargetFree fatty acid receptor 1(Homo sapiens (Human))
Johnson & Johnson Pharmaceutical
LigandPNGBDBM22488(3-Aryl-3-(4-phenoxy)-propionic Acid derivative, 24...)
Affinity DataEC50:  640nMT: 2°C. Assay description:  Human embryonic kidney (HEK293) cells expressing human GPR40 receptors were grown in Dulbecco modified Eagles medium (DMEM)/F12 media supplemented w...
In DepthDetails ArticlePubMed