BDBM22527 3-(4-{[(3-methanesulfonamidophenyl)methyl]amino}phenyl)propanoic acid::carboxylic acid agonist, 44
SMILES CS(=O)(=O)Nc1cccc(CNc2ccc(CCC(O)=O)cc2)c1
InChI Key InChIKey=BKWPLPOBVTZXQN-UHFFFAOYSA-N
Data  1 EC50
  Tab Delimited (TSV)   2D SDfile   Computed 3D by Vconf -m prep SDfile
Find this compound or compounds like it in BindingDB:
Activity Spreadsheet -- Enzyme Inhibition Constant Data from BindingDB
Found 1 hit for monomerid = 22527
TargetFree fatty acid receptor 1(Homo sapiens (Human))
Gsk
LigandPNGBDBM22527(3-(4-{[(3-methanesulfonamidophenyl)methyl]amino}ph...)
Affinity DataEC50: >3.16E+4nMT: 2°C. Assay description: The reporter assay for the stable hGPR40-Gal4-Elk1/5xGal4-luc+-expressing CHO cells was first carried out in the serum-free medium in the presence of...
Ligand InfoPC cidPC sid
In DepthDetails ArticlePubMed