BDBM232001 US9340517, 389
SMILES CCC(CC)CN1CC[C@H](CNC(=O)c2ccc3cc(F)ccc3c2)N[C@H](CCN2CCCCC2)C1=O
InChI Key InChIKey=BDLQPOKUIAQPOP-VSGBNLITSA-N
Data  1 IC50
  Tab Delimited (TSV)   2D SDfile   Computed 3D by Vconf -m prep SDfile
Find this compound or compounds like it in BindingDB:
Activity Spreadsheet -- Enzyme Inhibition Constant Data from BindingDB
Found 1 hit for monomerid = 232001
TargetMelanocortin receptor 5(Homo sapiens (Human))
Mimetica
US Patent
LigandPNGBDBM232001(US9340517, 389)
Affinity DataIC50: <100nMpH: 7.4 T: 2°C. Assay description: Assessments of compound binding to human MC5R (hMC5R)) by displacement of an 125I-labeled NDP-MSH receptor ligand peptide were performed essentially ...
Ligand InfoPC cidPC sid
In DepthDetails US Patent