BDBM243814 US9428456, 2.017
SMILES CC(C)(NC(=O)C1CCN(Cc2cccc(NC(=O)c3ccc(Cl)cc3)c2)CC1)c1ccccc1
InChI Key InChIKey=BTXZRKDDICSGNN-UHFFFAOYSA-N
Data  1 EC50
  Tab Delimited (TSV)   2D SDfile   Computed 3D by Vconf -m prep SDfile
Find this compound or compounds like it in BindingDB:
Activity Spreadsheet -- Enzyme Inhibition Constant Data from BindingDB
Found 1 hit for monomerid = 243814
TargetAtypical chemokine receptor 3(Homo sapiens (Human))
Actelion Pharmaceuticals
US Patent
LigandPNGBDBM243814(US9428456, 2.017)
Affinity DataEC50:  219nMT: 2°C. Assay description: CHO-K1 CXCR7 b-arrestin cells are detached from culture dishes with a cell dissociation buffer (Invitrogen, #13151-014) and collected in growing medi...
Ligand InfoPC cidPC sid
In DepthDetails US Patent