BDBM243869 US9428456, 1.107
SMILES O=C(NC1CCCCC1)C1CCN(Cc2cccc(NC(=O)c3ccc(cc3)C#N)c2)CC1
InChI Key InChIKey=CCBHNNBGAXYMMJ-UHFFFAOYSA-N
Data  1 EC50
  Tab Delimited (TSV)   2D SDfile   Computed 3D by Vconf -m prep SDfile
Find this compound or compounds like it in BindingDB:
Activity Spreadsheet -- Enzyme Inhibition Constant Data from BindingDB
Found 1 hit for monomerid = 243869
TargetAtypical chemokine receptor 3(Homo sapiens (Human))
Actelion Pharmaceuticals
US Patent
LigandPNGBDBM243869(US9428456, 1.107)
Affinity DataEC50:  8nMT: 2°C. Assay description: CHO-K1 CXCR7 b-arrestin cells are detached from culture dishes with a cell dissociation buffer (Invitrogen, #13151-014) and collected in growing medi...
Ligand InfoPC cidPC sid
In DepthDetails US Patent