BDBM243939 US9428456, 2.052
SMILES Cc1cncc(c1)C(=O)Nc1cccc(CN2CCC(CC2)C(=O)N2CC[C@@H](F)C2)c1
InChI Key InChIKey=BLYLYYYSFJHHDJ-OAQYLSRUSA-N
Data  1 EC50
  Tab Delimited (TSV)   2D SDfile   Computed 3D by Vconf -m prep SDfile
Find this compound or compounds like it in BindingDB:
Activity Spreadsheet -- Enzyme Inhibition Constant Data from BindingDB
Found 1 hit for monomerid = 243939
TargetAtypical chemokine receptor 3(Homo sapiens (Human))
Actelion Pharmaceuticals
US Patent
LigandPNGBDBM243939(US9428456, 2.052)
Affinity DataEC50:  121nMT: 2°C. Assay description: CHO-K1 CXCR7 b-arrestin cells are detached from culture dishes with a cell dissociation buffer (Invitrogen, #13151-014) and collected in growing medi...
Ligand InfoPC cidPC sid
In DepthDetails US Patent