BDBM252671 US9458176, 68
SMILES C[C@@H]1Cn2c(CCO1)c(nc2-c1ccc(Cl)c(OC(F)(F)F)c1)-c1cc(C)nc(C)c1
InChI Key InChIKey=ATRKWQYRPBFBDA-CQSZACIVSA-N
Data  1 IC50
  Tab Delimited (TSV)   2D SDfile   Computed 3D by Vconf -m prep SDfile
Find this compound or compounds like it in BindingDB:
Activity Spreadsheet -- Enzyme Inhibition Constant Data from BindingDB
Found 1 hit for monomerid = 252671
TargetMetabotropic glutamate receptor 2(Homo sapiens (Human))
Eisai R&D Management
US Patent
LigandPNGBDBM252671(US9458176, 68)
Affinity DataIC50:  13.2nMT: 2°C. Assay description: The frozen cell membrane fraction prepared as described above was thawed before use, and the resultant was diluted with a buffer for a binding assay ...
Ligand InfoPC cidPC sid
In DepthDetails US Patent