BDBM25322 2-bromo-3,5-dinitro-N-[(phenylcarbamoyl)amino]benzamide::ChemBridge N-phenylhydrazinecarboxamide, 17
SMILES [O-][N+](=O)c1cc(C(=O)NNC(=O)Nc2ccccc2)c(Br)c(c1)[N+]([O-])=O
InChI Key InChIKey=GSLFCLBARLUAMP-UHFFFAOYSA-N
Data  1 IC50
  Tab Delimited (TSV)   2D SDfile   Computed 3D by Vconf -m prep SDfile
Find this compound or compounds like it in BindingDB:
Activity Spreadsheet -- Enzyme Inhibition Constant Data from BindingDB
Found 1 hit for monomerid = 25322
TargetATP phosphoribosyltransferase(Mycobacterium tuberculosis)
Yale University
LigandPNGBDBM25322(2-bromo-3,5-dinitro-N-[(phenylcarbamoyl)amino]benz...)
Affinity DataIC50:  5.50E+3nMpH: 8.5 T: 2°C. Assay description: Inhibition activity was determined using an assay that followed the production of PR-ATP spectrophotometrically. Enzymatic reaction was initiated by ...
In DepthDetails ArticlePubMed