BDBM26717 N-[4-(6-methyl-1,3-benzothiazol-2-yl)phenyl]-1-(thiophen-2-ylcarbonyl)piperidine-4-carboxamide::benzothiazole analogue, 14a
SMILES Cc1ccc2nc(sc2c1)-c1ccc(NC(=O)C2CCN(CC2)C(=O)c2cccs2)cc1
InChI Key InChIKey=LTSNUSUAMLPUAU-UHFFFAOYSA-N
Data  1 IC50
  Tab Delimited (TSV)   2D SDfile   Computed 3D by Vconf -m prep SDfile
Find this compound or compounds like it in BindingDB:
Activity Spreadsheet -- Enzyme Inhibition Constant Data from BindingDB
Found 1 hit for monomerid = 26717
TargetFatty-acid amide hydrolase 1 [30-579](Rattus norvegicus (rat))
Abbott Laboratories
LigandPNGBDBM26717(N-[4-(6-methyl-1,3-benzothiazol-2-yl)phenyl]-1-(th...)
Affinity DataIC50:  2.37E+3nMpH: 8.0 T: 2°C. Assay description: [3H]anandamide was incubated with membranes to produce radiolabeled ethanolamine and unlabeled arachidonic acid. Charcoal selectively binds anandamid...
In DepthDetails ArticlePubMed