BDBM35865 benzyloxyacetic acid analogue, 21
SMILES OC(=O)COCc1ccc(Cn2cccn2)cc1OCCc1ccc2ccccc2c1
InChI Key InChIKey=BHCJZNGDYXVVII-UHFFFAOYSA-N
Data  4 KI  1 EC50
  Tab Delimited (TSV)   2D SDfile   Computed 3D by Vconf -m prep SDfile
Find this compound or compounds like it in BindingDB:
Activity Spreadsheet -- Enzyme Inhibition Constant Data from BindingDB
Found 4 hits for monomerid = 35865
TargetProstaglandin E2 receptor EP3 subtype(Mus musculus (Mouse))
Ono Pharmaceutical
LigandPNGBDBM35865(benzyloxyacetic acid analogue, 21)
Affinity DataKi:  210nM EC50:  540nM. Assay description: Competitive binding studies were conducted using radiolabeled ligands and membrane fractions prepared from Chinese hamster ovary (CHO) cells stably e...
In DepthDetails ArticlePubMed
TargetProstaglandin E2 receptor EP2 subtype(Mus musculus (Mouse))
Ono Pharmaceutical
LigandPNGBDBM35865(benzyloxyacetic acid analogue, 21)
Affinity DataKi:  1.30E+3nM. Assay description: Competitive binding studies were conducted using radiolabeled ligands and membrane fractions prepared from Chinese hamster ovary (CHO) cells stably e...
In DepthDetails ArticlePubMed
TargetProstaglandin E2 receptor EP4 subtype(Mus musculus (Mouse))
Ono Pharmaceutical
LigandPNGBDBM35865(benzyloxyacetic acid analogue, 21)
Affinity DataKi: >1.00E+4nM. Assay description: Competitive binding studies were conducted using radiolabeled ligands and membrane fractions prepared from Chinese hamster ovary (CHO) cells stably e...
In DepthDetails ArticlePubMed
TargetProstaglandin E2 receptor EP1 subtype(Mus musculus (Mouse))
Ono Pharmaceutical
LigandPNGBDBM35865(benzyloxyacetic acid analogue, 21)
Affinity DataKi: >1.00E+4nM ΔG°: >-6.82kcal/molepH: 6.0 T: 2°C. Assay description: Competitive binding studies were conducted using radiolabeled ligands and membrane fractions prepared from Chinese hamster ovary (CHO) cells stably e...
In DepthDetails ArticlePubMed