BDBM37347 4-(5,6-diphenyl-1,2,4-triazin-3-yl)morpholine::MLS000106215::SMR000103184::cid_2842253
SMILES C1CN(CCO1)c1nnc(-c2ccccc2)c(n1)-c1ccccc1
InChI Key InChIKey=XAYFWWVZSYKDIS-UHFFFAOYSA-N
Data  1 EC50
  Tab Delimited (TSV)   2D SDfile   Computed 3D by Vconf -m prep SDfile
Find this compound or compounds like it in BindingDB:
Activity Spreadsheet -- Enzyme Inhibition Constant Data from BindingDB
Found 1 hit for monomerid = 37347
TargetSphingosine 1-phosphate receptor 3(Homo sapiens (Human))
The Scripps Research Institute Molecular Screening Center
Curated by PubChem BioAssay
LigandPNGBDBM37347(4-(5,6-diphenyl-1,2,4-triazin-3-yl)morpholine | ML...)
Affinity DataEC50:  6.63E+3nM. Assay description: Source (MLSCN Center Name): The Scripps Research Institute Molecular Screening Center Center Affiliation: The Scripps Research Institute, TSRI Networ...
In DepthDetails PCBioAssay