BDBM46745 (Z)-(4-chlorodithiazol-5-ylidene)-(2-thiazolin-2-yl)amine::(Z)-4-chloranyl-N-(4,5-dihydro-1,3-thiazol-2-yl)-1,2,3-dithiazol-5-imine::(Z)-4-chloro-N-(4,5-dihydro-1,3-thiazol-2-yl)dithiazol-5-imine::(Z)-4-chloro-N-(4,5-dihydrothiazol-2-yl)-5-dithiazolimine::MLS-0391024.0001::cid_5951502
SMILES Clc1nss\c1=N/C1=NCCS1
InChI Key InChIKey=WFZDWBWLYYTBFT-YWEYNIOJSA-N
Data  1 IC50
  Tab Delimited (TSV)   2D SDfile   Computed 3D by Vconf -m prep SDfile
Find this compound or compounds like it in BindingDB:
Activity Spreadsheet -- Enzyme Inhibition Constant Data from BindingDB
Found 1 hit for monomerid = 46745
TargetMannose-6-phosphate isomerase(Homo sapiens (Human))
Burnham Center For Chemical Genomics
Curated by PubChem BioAssay
LigandPNGBDBM46745((Z)-(4-chlorodithiazol-5-ylidene)-(2-thiazolin-2-y...)
Affinity DataIC50: >1.00E+5nM. Assay description: Data Source: Sanford-Burnham Center for Chemical Genomics (SBCCG) Source Affiliation: Sanford-Burnham Medical Research Institute (SBMRI, San Diego, C...
In DepthDetails PCBioAssay