BDBM50000993 CHEMBL3235258
SMILES C[C@@H]1CC[C@H](CN1C(=O)c1cc(C)ccc1-n1nccn1)C#Cc1cnccc1O
InChI Key InChIKey=AFSMIXILBLVITN-MSOLQXFVSA-N
Data  2 KI  2 IC50
  Tab Delimited (TSV)   2D SDfile   Computed 3D by Vconf -m prep SDfile
Find this compound or compounds like it in BindingDB:
Activity Spreadsheet -- Enzyme Inhibition Constant Data from BindingDB
Found 4 hits for monomerid = 50000993
TargetOrexin receptor type 2(Homo sapiens (Human))
Merck Research Laboratories
Curated by ChEMBL
LigandPNGBDBM50000993(CHEMBL3235258)
Affinity DataKi:  7.5nM. Assay description: Binding affinity to human OX2 receptor in cell membrane by in vitro radioligand binding assay
In DepthDetails ArticlePubMed
TargetOrexin/Hypocretin receptor type 1(Homo sapiens (Human))
Merck Research Laboratories
Curated by ChEMBL
LigandPNGBDBM50000993(CHEMBL3235258)
Affinity DataKi:  866nM. Assay description: Binding affinity to human OX1 receptor in cell membrane by in vitro radioligand binding assay
In DepthDetails ArticlePubMed
TargetOrexin receptor type 2(Homo sapiens (Human))
Merck Research Laboratories
Curated by ChEMBL
LigandPNGBDBM50000993(CHEMBL3235258)
Affinity DataIC50:  52nM. Assay description: Antagonist activity at human OX2 receptor assessed as Ca2+ flux by FLIPR assay
In DepthDetails ArticlePubMed
TargetOrexin/Hypocretin receptor type 1(Homo sapiens (Human))
Merck Research Laboratories
Curated by ChEMBL
LigandPNGBDBM50000993(CHEMBL3235258)
Affinity DataIC50:  3.88E+3nM. Assay description: Antagonist activity at human OX1 receptor assessed as Ca2+ flux by FLIPR assay
In DepthDetails ArticlePubMed