BDBM50003010 CHEMBL236659
SMILES CC(C)(NC(=O)c1cc2ccccc2s1)C(=O)N[C@@H](Cc1ccccc1)C(=O)NCCOCCOCCN
InChI Key InChIKey=BDKNKWVGMGUBOG-QFIPXVFZSA-N
Data  1 KI
  Tab Delimited (TSV)   2D SDfile   Computed 3D by Vconf -m prep SDfile
Find this compound or compounds like it in BindingDB:
Activity Spreadsheet -- Enzyme Inhibition Constant Data from BindingDB
Found 1 hit for monomerid = 50003010
TargetSubstance-K receptor(Homo sapiens (Human))
Menarini Ricerche
Curated by ChEMBL
LigandPNGBDBM50003010(CHEMBL236659)
Affinity DataKi:  100nM. Assay description: Displacement of [125I]NKA from human NK2 expressed in CHO-K1 cellsChecked by Author
In DepthDetails ArticlePubMed