BDBM50003303 CHEMBL3234551
SMILES Cc1ccnc(n1)N1CCC[C@H](C1)C(=O)NCCc1ccc(F)cc1
InChI Key InChIKey=BIUQQORTCGYIOM-MRXNPFEDSA-N
Data  2 EC50
  Tab Delimited (TSV)   2D SDfile   Computed 3D by Vconf -m prep SDfile
Find this compound or compounds like it in BindingDB:
Activity Spreadsheet -- Enzyme Inhibition Constant Data from BindingDB
Found 2 hits for monomerid = 50003303
TargetG-protein coupled bile acid receptor 1(Homo sapiens (Human))
Genomics Institute Of The Novartis Research Foundation
Curated by ChEMBL
LigandPNGBDBM50003303(CHEMBL3234551)
Affinity DataEC50:  320nM. Assay description: Agonist activity at human TGR5 expressed in Jurkat cells assessed as intracellular cAMP level after 1 hr by HTRF assay
In DepthDetails ArticlePubMed
TargetG-protein coupled bile acid receptor 1(Mus musculus)
Genomics Institute Of The Novartis Research Foundation
Curated by ChEMBL
LigandPNGBDBM50003303(CHEMBL3234551)
Affinity DataEC50:  750nM. Assay description: Agonist activity at mouse TGR5 expressed in Jurkat cells assessed as intracellular cAMP level after 1 hr by HTRF assay
In DepthDetails ArticlePubMed