BDBM50006054 3-{3-[Hydroxy-(3-tetradecyloxy-phenoxy)-phosphoryloxy]-benzyl}-thiazol-3-ium::CHEMBL291177
SMILES CCCCCCCCCCCCCCOc1cccc(OP([O-])(=O)Oc2cccc(C[n+]3ccsc3)c2)c1
InChI Key InChIKey=APKUXWDMTISSKI-UHFFFAOYSA-N
Data  1 IC50
  Tab Delimited (TSV)   2D SDfile   Computed 3D by Vconf -m prep SDfile
Find this compound or compounds like it in BindingDB:
Activity Spreadsheet -- Enzyme Inhibition Constant Data from BindingDB
Found 1 hit for monomerid = 50006054
TargetPlatelet-activating factor receptor(Cavia porcellus)
American Cyanamid
Curated by ChEMBL
LigandPNGBDBM50006054(3-{3-[Hydroxy-(3-tetradecyloxy-phenoxy)-phosphoryl...)
Affinity DataIC50:  6.15E+3nM. Assay description: Inhibition of PAF induced platelet aggregation in rabbit
In DepthDetails ArticlePubMed