BDBM50012411 2-Furan-2-yl-5-methyl-thiazol-4-ol::CHEMBL302945
SMILES Cc1sc(nc1O)-c1ccco1
InChI Key InChIKey=UZZVOPZMQYNZHR-UHFFFAOYSA-N
Data  1 IC50
  Tab Delimited (TSV)   2D SDfile   Computed 3D by Vconf -m prep SDfile
Find this compound or compounds like it in BindingDB:
Activity Spreadsheet -- Enzyme Inhibition Constant Data from BindingDB
Found 1 hit for monomerid = 50012411
TargetPolyunsaturated fatty acid 5-lipoxygenase(Rattus norvegicus)
Abbott Laboratories
Curated by ChEMBL
LigandPNGBDBM50012411(2-Furan-2-yl-5-methyl-thiazol-4-ol | CHEMBL302945)
Affinity DataIC50:  2.40E+3nM. Assay description: In vitro inhibition of 5-lipoxygenase (5-lo) from the 20000 g supernatant of RBI-1 cells
In DepthDetails ArticlePubMed