BDBM50019260 1H-Indole-2-carboxylic acid [5-(2-fluoro-phenyl)-2-oxo-2,3-dihydro-1H-benzo[e][1,4]diazepin-3-yl]-amide::1H-Indole-2-carboxylic acid [5-(2-fluoro-phenyl)-2-oxo-2,3-dihydro-1H-benzo[e][1,4]diazepin-3-yl]-amide: 0.16CH2Cl2::CCK antagonist synthetic 21::CHEMBL306806
SMILES Fc1ccccc1C1=NC(NC(=O)c2cc3ccccc3[nH]2)C(=O)Nc2ccccc12
InChI Key InChIKey=CZSIXZKMOIKIMG-UHFFFAOYSA-N
Data  2 KI  4 IC50
  Tab Delimited (TSV)   2D SDfile   Computed 3D by Vconf -m prep SDfile
Find this compound or compounds like it in BindingDB:
Activity Spreadsheet -- Enzyme Inhibition Constant Data from BindingDB
Found 6 hits for monomerid = 50019260
TargetCholecystokinin(RAT)
Merck Sharp & Dohme Research Laboratories
Curated by PDSP Ki Database
LigandPNGBDBM50019260(1H-Indole-2-carboxylic acid [5-(2-fluoro-phenyl)-2...)
Affinity DataKi:  2.10nM
In DepthDetails ArticlePubMed
TargetGABA(A) receptor-associated protein(GUINEA PIG)
Merck Sharp & Dohme Research Laboratories
Curated by PDSP Ki Database
LigandPNGBDBM50019260(1H-Indole-2-carboxylic acid [5-(2-fluoro-phenyl)-2...)
Affinity DataKi:  3.00E+3nM
In DepthDetails ArticlePubMed
TargetCholecystokinin receptor type A(RAT)
University Of Illinois At Chicago
Curated by ChEMBL
LigandPNGBDBM50019260(1H-Indole-2-carboxylic acid [5-(2-fluoro-phenyl)-2...)
Affinity DataIC50:  2.09nM. Assay description: Binding affinity against cholecystokinin type A receptor of rat pancreas
In DepthDetails ArticlePubMed
TargetGastrin/cholecystokinin type B receptor(Homo sapiens (Human))
Merck Sharp & Dohme Research Laboratories
Curated by ChEMBL
LigandPNGBDBM50019260(1H-Indole-2-carboxylic acid [5-(2-fluoro-phenyl)-2...)
Affinity DataIC50:  4.60E+3nM. Assay description: Half-maximal inhibition of [125I]gastrin binding to guinea pig gastric glands
In DepthDetails ArticlePubMed
TargetCholecystokinin receptor type A/Gastrin/cholecystokinin type B receptor(Homo sapiens (Human))
Merck Sharp & Dohme Research Laboratories
Curated by ChEMBL
LigandPNGBDBM50019260(1H-Indole-2-carboxylic acid [5-(2-fluoro-phenyl)-2...)
Affinity DataIC50:  3.00E+3nM. Assay description: Half-maximal inhibition of [125I]-CCK-8(+) binding to cholecystokinin receptor from guinea pig brain tissue
In DepthDetails ArticlePubMed
TargetCholecystokinin receptor type A(RAT)
University Of Illinois At Chicago
Curated by ChEMBL
LigandPNGBDBM50019260(1H-Indole-2-carboxylic acid [5-(2-fluoro-phenyl)-2...)
Affinity DataIC50:  2.10nM. Assay description: Half-maximal inhibition of [125I]CCK-33 binding to cholecystokinin A receptor from rat pancreatic tissue
In DepthDetails ArticlePubMed