BDBM50021146 2-(1-Carboxymethyl-2-oxo-2,3,4,5-tetrahydro-1H-benzo[b]azepin-3-ylamino)-4-methyl-pentanoic acid methyl ester::CHEMBL290328
SMILES COC(=O)[C@H](CC(C)C)N[C@H]1CCc2ccccc2N(CC(O)=O)C1=O
InChI Key InChIKey=DIAKVMVEHAUODE-GJZGRUSLSA-N
Data  1 IC50
  Tab Delimited (TSV)   2D SDfile   Computed 3D by Vconf -m prep SDfile
Find this compound or compounds like it in BindingDB:
Activity Spreadsheet -- Enzyme Inhibition Constant Data from BindingDB
Found 1 hit for monomerid = 50021146
TargetAngiotensin-converting enzyme(Homo sapiens (Human))
TBA
Curated by ChEMBL
LigandPNGBDBM50021146(2-(1-Carboxymethyl-2-oxo-2,3,4,5-tetrahydro-1H-ben...)
Affinity DataIC50:  1.00E+3nM. Assay description: In vitro inhibitory activity against Angiotensin I converting enzyme
In DepthDetails ArticlePubMed