BDBM50027196 5-(4-Hydroxy-4-methyl-piperidin-1-yl)-2,2-diphenyl-pentanenitrile::CHEMBL380793
SMILES CC1(O)CCN(CCCC(C#N)(c2ccccc2)c2ccccc2)CC1
InChI Key InChIKey=QFIUGKSNPZWDNR-UHFFFAOYSA-N
Data  1 IC50  1 EC50
  Tab Delimited (TSV)   2D SDfile   Computed 3D by Vconf -m prep SDfile
Find this compound or compounds like it in BindingDB:
Activity Spreadsheet -- Enzyme Inhibition Constant Data from BindingDB
Found 2 hits for monomerid = 50027196
TargetG-protein coupled receptor homolog US28(Human cytomegalovirus (strain AD169) (HHV-5) (Huma...)
Vrije Universiteit
Curated by PDSP Ki Database
LigandPNGBDBM50027196(5-(4-Hydroxy-4-methyl-piperidin-1-yl)-2,2-diphenyl...)
Affinity DataEC50: >1.00E+5nM. Assay description: Effective concentration against US28-mediated inositol phosphate production in COS-7 cells
In DepthDetails ArticlePubMed
TargetG-protein coupled receptor homolog US28(Human cytomegalovirus (strain AD169) (HHV-5) (Huma...)
Vrije Universiteit
Curated by PDSP Ki Database
LigandPNGBDBM50027196(5-(4-Hydroxy-4-methyl-piperidin-1-yl)-2,2-diphenyl...)
Affinity DataIC50: >1.00E+5nM. Assay description: Inhibitory concentration against chemokine receptor US28 expressed in COS-7 cells using [125I]-CCL5
In DepthDetails ArticlePubMed