BDBM50029346 3-(6-Amino-hexyl)-8-chloro-5-phenyl-2,3,4,5-tetrahydro-1H-benzo[d]azepin-7-ol::CHEMBL137637
SMILES NCCCCCCN1CCc2cc(Cl)c(O)cc2C(C1)c1ccccc1
InChI Key InChIKey=AXHDPJPTYSIEGZ-UHFFFAOYSA-N
Data  2 KI
  Tab Delimited (TSV)   2D SDfile   Computed 3D by Vconf -m prep SDfile
Find this compound or compounds like it in BindingDB:
Activity Spreadsheet -- Enzyme Inhibition Constant Data from BindingDB
Found 2 hits for monomerid = 50029346
TargetD(1A) dopamine receptor(RAT)
National Institutes Of Health
Curated by ChEMBL
LigandPNGBDBM50029346(3-(6-Amino-hexyl)-8-chloro-5-phenyl-2,3,4,5-tetrah...)
Affinity DataKi:  321nM. Assay description: Binding affinity against dopamine receptor D1 from rat striatal membranes using [3H]-SCH- 23390 as radioligand.
In DepthDetails ArticlePubMed
TargetD(2) dopamine receptor(Rattus norvegicus (rat))
National Institutes Of Health
Curated by ChEMBL
LigandPNGBDBM50029346(3-(6-Amino-hexyl)-8-chloro-5-phenyl-2,3,4,5-tetrah...)
Affinity DataKi:  2.49E+3nM. Assay description: Binding affinity against Dopamine receptor D2 from rat striatal membranes, using [3H]sulpiride as radioligand.
In DepthDetails ArticlePubMed